{"text_format":"1","workbook":"xlsx","n_sheets":8,"sheets":["はじめに","読込","list","hol","record","record_org","cal","タイムカード"],"not_rendered":{"charts":0,"images":2,"macros":1,"external_links":0,"defined_names":2,"comments":0,"pivot_tables":0},"unopened":[],"bounds":{"document_bytes":16777216,"sheet_cells":100000,"rows_first":2000,"rows_last":500,"rows_between":2000,"halvings":0,"cell_chars":16384,"cell_head_chars":4096},"cells_cut":0,"cells_raw":0,"read":"whole","date_system":"1900"}

{"sheet":"はじめに","index":0,"n_rows":28,"n_cols":4,"rows_kept":28,"cut":false,"hidden":false,"merged":[]}
[]
[null,"はじめに（初期設定）"]
[null,null,null,"このファイルはマクロを使用しています"]
[null,null,null,"「セキュリティの警告」が表示されますので、「コンテンツの有効化」をクリックしてください"]
[]
[null,null,"'list'シート"]
[null,null,null,"従業員リストの入力"]
[null,null,null,"ThermoManagerAC（以下チェッカー）に登録した従業員の氏名を'list'シートに入力します"]
[null,null,null,"関数にて=（イコール）で照合していますので、チェッカーの登録名と全く同一にしてください"]
[null,null,null,"※スペース(半角・全角)有無等に注意"]
[]
[null,null,null,"テーブル('cal'シート)の最適化"]
[null,null,null,"入力した従業員の人数×25日分の計算用テーブルを作成します"]
[null,null,null,"全員の氏名を入力し終えたら、「従業員の数でテーブルを最適化」ボタンをクリックしてください"]
[null,null,null,"※月途中で従業員を追加・削除した際も最適化してください"]
[]
[null,null,"'hol'シート"]
[null,null,null,"所定休日の入力"]
[null,null,null,"'hol'シートに所定休日を入力すると、タイムカードで休日の行がライトグレーで表示されます"]
[]
{"$rows_left_out":9}
{"sheet":"読込","index":1,"n_rows":3,"n_cols":2,"rows_kept":3,"cut":false,"hidden":false,"merged":[]}
[]
[null,"Thermo Maneger AC からダウンロードしたExcelファイルを読み込みます。"]
[null,"以下のボタンをクリックして下さい。"]

{"sheet":"list","index":2,"n_rows":5,"n_cols":1,"rows_kept":5,"cut":false,"hidden":false,"merged":[]}
["氏名"]
["富山　一郎"]
["富山　二郎"]
["富山　三郎"]
["富山　四郎"]

{"sheet":"hol","index":3,"n_rows":111,"n_cols":1,"rows_kept":111,"cut":false,"hidden":false,"merged":[]}
["所定休日"]
["2023-04-01"]
["2023-04-02"]
["2023-04-08"]
["2023-04-09"]
["2023-04-15"]
["2023-04-16"]
["2023-04-22"]
["2023-04-23"]
["2023-04-29"]
["2023-04-30"]
["2023-05-03"]
["2023-05-04"]
["2023-05-05"]
["2023-05-06"]
["2023-05-07"]
["2023-05-13"]
["2023-05-14"]
["2023-05-20"]
["2023-05-21"]
{"$rows_left_out":92}
{"sheet":"record","index":4,"n_rows":1,"n_cols":8,"rows_kept":1,"cut":false,"hidden":false,"merged":[]}
["ID","日付時刻","名前","性別","電話番号","アルコール濃度","おんど","画像のパス"]

{"sheet":"record_org","index":5,"n_rows":1,"n_cols":8,"rows_kept":1,"cut":false,"hidden":false,"merged":[]}
["ID","日付時刻","名前","性別","電話番号","アルコール濃度","おんど","画像のパス"]

{"sheet":"cal","index":6,"n_rows":101,"n_cols":10,"rows_kept":101,"cut":false,"hidden":false,"merged":[]}
["Name","Year","Month","Hour","Minute","日マタギ","Day","Time","Temp","Alc"]
[{"$f":"record!C2","v":0},{"$f":"YEAR(record!B2)","v":1900},{"$f":"MONTH(record!B2)","v":1},{"$f":"HOUR(record!B2)","v":0},{"$f":"MINUTE(record!B2)","v":0},{"$f":"IF(D2+24>29,0,1)","v":1},{"$f":"DAY(record!B2)-F2","v":-1},{"$f":"TIME(D2,E2,)+F2","v":1},{"$f":"record!G2","v":0},{"$f":"record!F2","v":0}]
[{"$f":"record!C3","v":0},{"$f":"YEAR(record!B3)","v":1900},{"$f":"MONTH(record!B3)","v":1},{"$f":"HOUR(record!B3)","v":0},{"$f":"MINUTE(record!B3)","v":0},{"$f":"IF(D3+24>29,0,1)","v":1},{"$f":"DAY(record!B3)-F3","v":-1},{"$f":"TIME(D3,E3,)+F3","v":1},{"$f":"record!G3","v":0},{"$f":"record!F3","v":0}]
[{"$f":"record!C4","v":0},{"$f":"YEAR(record!B4)","v":1900},{"$f":"MONTH(record!B4)","v":1},{"$f":"HOUR(record!B4)","v":0},{"$f":"MINUTE(record!B4)","v":0},1,{"$f":"DAY(record!B4)-F4","v":-1},1,{"$f":"record!G4","v":0},{"$f":"record!F4","v":0}]
[{"$f":"record!C5","v":0},{"$f":"YEAR(record!B5)","v":1900},{"$f":"MONTH(record!B5)","v":1},{"$f":"HOUR(record!B5)","v":0},{"$f":"MINUTE(record!B5)","v":0},1,{"$f":"DAY(record!B5)-F5","v":-1},1,{"$f":"record!G5","v":0},{"$f":"record!F5","v":0}]
[{"$f":"record!C6","v":0},{"$f":"YEAR(record!B6)","v":1900},{"$f":"MONTH(record!B6)","v":1},{"$f":"HOUR(record!B6)","v":0},{"$f":"MINUTE(record!B6)","v":0},1,{"$f":"DAY(record!B6)-F6","v":-1},1,{"$f":"record!G6","v":0},{"$f":"record!F6","v":0}]
[{"$f":"record!C7","v":0},{"$f":"YEAR(record!B7)","v":1900},{"$f":"MONTH(record!B7)","v":1},{"$f":"HOUR(record!B7)","v":0},{"$f":"MINUTE(record!B7)","v":0},1,{"$f":"DAY(record!B7)-F7","v":-1},1,{"$f":"record!G7","v":0},{"$f":"record!F7","v":0}]
[{"$f":"record!C8","v":0},{"$f":"YEAR(record!B8)","v":1900},{"$f":"MONTH(record!B8)","v":1},{"$f":"HOUR(record!B8)","v":0},{"$f":"MINUTE(record!B8)","v":0},1,{"$f":"DAY(record!B8)-F8","v":-1},1,{"$f":"record!G8","v":0},{"$f":"record!F8","v":0}]
[{"$f":"record!C9","v":0},{"$f":"YEAR(record!B9)","v":1900},{"$f":"MONTH(record!B9)","v":1},{"$f":"HOUR(record!B9)","v":0},{"$f":"MINUTE(record!B9)","v":0},1,{"$f":"DAY(record!B9)-F9","v":-1},1,{"$f":"record!G9","v":0},{"$f":"record!F9","v":0}]
[{"$f":"record!C10","v":0},{"$f":"YEAR(record!B10)","v":1900},{"$f":"MONTH(record!B10)","v":1},{"$f":"HOUR(record!B10)","v":0},{"$f":"MINUTE(record!B10)","v":0},1,{"$f":"DAY(record!B10)-F10","v":-1},1,{"$f":"record!G10","v":0},{"$f":"record!F10","v":0}]
[{"$f":"record!C11","v":0},{"$f":"YEAR(record!B11)","v":1900},{"$f":"MONTH(record!B11)","v":1},{"$f":"HOUR(record!B11)","v":0},{"$f":"MINUTE(record!B11)","v":0},1,{"$f":"DAY(record!B11)-F11","v":-1},1,{"$f":"record!G11","v":0},{"$f":"record!F11","v":0}]
[{"$f":"record!C12","v":0},{"$f":"YEAR(record!B12)","v":1900},{"$f":"MONTH(record!B12)","v":1},{"$f":"HOUR(record!B12)","v":0},{"$f":"MINUTE(record!B12)","v":0},1,{"$f":"DAY(record!B12)-F12","v":-1},1,{"$f":"record!G12","v":0},{"$f":"record!F12","v":0}]
[{"$f":"record!C13","v":0},{"$f":"YEAR(record!B13)","v":1900},{"$f":"MONTH(record!B13)","v":1},{"$f":"HOUR(record!B13)","v":0},{"$f":"MINUTE(record!B13)","v":0},1,{"$f":"DAY(record!B13)-F13","v":-1},1,{"$f":"record!G13","v":0},{"$f":"record!F13","v":0}]
[{"$f":"record!C14","v":0},{"$f":"YEAR(record!B14)","v":1900},{"$f":"MONTH(record!B14)","v":1},{"$f":"HOUR(record!B14)","v":0},{"$f":"MINUTE(record!B14)","v":0},1,{"$f":"DAY(record!B14)-F14","v":-1},1,{"$f":"record!G14","v":0},{"$f":"record!F14","v":0}]
[{"$f":"record!C15","v":0},{"$f":"YEAR(record!B15)","v":1900},{"$f":"MONTH(record!B15)","v":1},{"$f":"HOUR(record!B15)","v":0},{"$f":"MINUTE(record!B15)","v":0},1,{"$f":"DAY(record!B15)-F15","v":-1},1,{"$f":"record!G15","v":0},{"$f":"record!F15","v":0}]
[{"$f":"record!C16","v":0},{"$f":"YEAR(record!B16)","v":1900},{"$f":"MONTH(record!B16)","v":1},{"$f":"HOUR(record!B16)","v":0},{"$f":"MINUTE(record!B16)","v":0},1,{"$f":"DAY(record!B16)-F16","v":-1},1,{"$f":"record!G16","v":0},{"$f":"record!F16","v":0}]
[{"$f":"record!C17","v":0},{"$f":"YEAR(record!B17)","v":1900},{"$f":"MONTH(record!B17)","v":1},{"$f":"HOUR(record!B17)","v":0},{"$f":"MINUTE(record!B17)","v":0},1,{"$f":"DAY(record!B17)-F17","v":-1},1,{"$f":"record!G17","v":0},{"$f":"record!F17","v":0}]
[{"$f":"record!C18","v":0},{"$f":"YEAR(record!B18)","v":1900},{"$f":"MONTH(record!B18)","v":1},{"$f":"HOUR(record!B18)","v":0},{"$f":"MINUTE(record!B18)","v":0},1,{"$f":"DAY(record!B18)-F18","v":-1},1,{"$f":"record!G18","v":0},{"$f":"record!F18","v":0}]
[{"$f":"record!C19","v":0},{"$f":"YEAR(record!B19)","v":1900},{"$f":"MONTH(record!B19)","v":1},{"$f":"HOUR(record!B19)","v":0},{"$f":"MINUTE(record!B19)","v":0},1,{"$f":"DAY(record!B19)-F19","v":-1},1,{"$f":"record!G19","v":0},{"$f":"record!F19","v":0}]
[{"$f":"record!C20","v":0},{"$f":"YEAR(record!B20)","v":1900},{"$f":"MONTH(record!B20)","v":1},{"$f":"HOUR(record!B20)","v":0},{"$f":"MINUTE(record!B20)","v":0},1,{"$f":"DAY(record!B20)-F20","v":-1},1,{"$f":"record!G20","v":0},{"$f":"record!F20","v":0}]
{"$rows_left_out":82}
{"sheet":"タイムカード","index":7,"n_rows":40,"n_cols":19,"rows_kept":40,"cut":false,"hidden":false,"merged":[[1,3,1,5]]}
[null,null,null,null,null,null,null,null,null,null,null,null,null,null,null,null,"MaxRecord",{"$f":"COUNTA(cal!A:A)-1","v":100},"件"]
[null,"氏名",null,"富山　一郎",null,null,null,null,null,null,null,null,{"$f":"VALUE(record!B3)","v":"00:00:00"}]
[]
[]
[null,null,null,"タイムカード",null,null,null,"就業時間",null,null,null,"アルコール"]
[null,"日(曜日)",null,1,2,"合計","休憩","基本","残業","深夜","体温","出勤時","退勤時",null,null,"PDF形式でエクスポート"]
[null,{"$f":"DAY(DATE(cal!$B$2,cal!$C$2,1))","v":1},{"$f":"DATE(cal!$B$2,cal!$C$2,B7)","v":1},{"$f":"IFERROR(INDEX(OFFSET(cal!$H$1,0,0,$R$1-1,1),1/LARGE(INDEX((OFFSET(cal!$A$1,0,0,$R$1-1,1)=$D$2)*(OFFSET(cal!$G$1,0,0,$R$1-1,1)=$B7)/ROW(OFFSET(cal!$A$1,0,0,$R$1-1,1)),0),D$6)),\"\")","v":""},{"$f":"IFERROR(INDEX(OFFSET(cal!$H$1,0,0,$R$1-1,1),1/LARGE(INDEX((OFFSET(cal!$A$1,0,0,$R$1-1,1)=$D$2)*(OFFSET(cal!$G$1,0,0,$R$1-1,1)=$B7)/ROW(OFFSET(cal!$A$1,0,0,$R$1-1,1)),0),E$6)),\"\")","v":""},{"$f":"IF(ISERROR(E7-D7),\"\",E7-D7)","v":""},{"$f":"IF(F7=\"\",\"\",IF(E7-D7<=TIME(6,,),0,TIME(1,,)))","v":""},{"$f":"IF(F7=\"\",\"\",IF(F7-G7<TIME(8,,),F7-G7,TIME(8,,)))","v":""},{"$f":"IF(F7=\"\",\"\",F7-G7-H7)","v":""},{"$f":"IF(F7=\"\",\"\",IF(E7>TIME(22,,),E7-TIME(22,,),0))","v":""},{"$f":"IFERROR(INDEX(OFFSET(cal!$I$1,0,0,$R$1-1,1),1/LARGE(INDEX((OFFSET(cal!$A$1,0,0,$R$1-1,1)=$D$2)*(OFFSET(cal!$G$1,0,0,$R$1-1,1)=$B7)/ROW(OFFSET(cal!$A$1,0,0,$R$1-1,1)),0),D$6)),\"\")","v":""},{"$f":"IFERROR(INDEX(OFFSET(cal!$J$1,0,0,$R$1-1,1),1/LARGE(INDEX((OFFSET(cal!$A$1,0,0,$R$1-1,1)=$D$2)*(OFFSET(cal!$G$1,0,0,$R$1-1,1)=$B7)/ROW(OFFSET(cal!$A$1,0,0,$R$1-1,1)),0),D$6)),\"\")","v":""},{"$f":"IFERROR(INDEX(OFFSET(cal!$J$1,0,0,$R$1-1,1),1/LARGE(INDEX((OFFSET(cal!$A$1,0,0,$R$1-1,1)=$D$2)*(OFFSET(cal!$G$1,0,0,$R$1-1,1)=$B7)/ROW(OFFSET(cal!$A$1,0,0,$R$1-1,1)),0),E$6)),\"\")","v":""}]
[null,{"$f":"B7+1","v":2},{"$f":"DATE(cal!$B$2,cal!$C$2,B8)","v":2},{"$f":"IFERROR(INDEX(OFFSET(cal!$H$1,0,0,$R$1-1,1),1/LARGE(INDEX((OFFSET(cal!$A$1,0,0,$R$1-1,1)=$D$2)*(OFFSET(cal!$G$1,0,0,$R$1-1,1)=$B8)/ROW(OFFSET(cal!$A$1,0,0,$R$1-1,1)),0),D$6)),\"\")","v":""},{"$f":"IFERROR(INDEX(OFFSET(cal!$H$1,0,0,$R$1-1,1),1/LARGE(INDEX((OFFSET(cal!$A$1,0,0,$R$1-1,1)=$D$2)*(OFFSET(cal!$G$1,0,0,$R$1-1,1)=$B8)/ROW(OFFSET(cal!$A$1,0,0,$R$1-1,1)),0),E$6)),\"\")","v":""},{"$f":"IF(ISERROR(E8-D8),\"\",E8-D8)","v":""},{"$f":"IF(F8=\"\",\"\",IF(E8-D8<=TIME(6,,),0,TIME(1,,)))","v":""},{"$f":"IF(F8=\"\",\"\",IF(F8-G8<TIME(8,,),F8-G8,TIME(8,,)))","v":""},{"$f":"IF(F8=\"\",\"\",F8-G8-H8)","v":""},{"$f":"IF(F8=\"\",\"\",IF(E8>TIME(22,,),E8-TIME(22,,),0))","v":""},{"$f":"IFERROR(INDEX(OFFSET(cal!$I$1,0,0,$R$1-1,1),1/LARGE(INDEX((OFFSET(cal!$A$1,0,0,$R$1-1,1)=$D$2)*(OFFSET(cal!$G$1,0,0,$R$1-1,1)=$B8)/ROW(OFFSET(cal!$A$1,0,0,$R$1-1,1)),0),D$6)),\"\")","v":""},{"$f":"IFERROR(INDEX(OFFSET(cal!$J$1,0,0,$R$1-1,1),1/LARGE(INDEX((OFFSET(cal!$A$1,0,0,$R$1-1,1)=$D$2)*(OFFSET(cal!$G$1,0,0,$R$1-1,1)=$B8)/ROW(OFFSET(cal!$A$1,0,0,$R$1-1,1)),0),D$6)),\"\")","v":""},{"$f":"IFERROR(INDEX(OFFSET(cal!$J$1,0,0,$R$1-1,1),1/LARGE(INDEX((OFFSET(cal!$A$1,0,0,$R$1-1,1)=$D$2)*(OFFSET(cal!$G$1,0,0,$R$1-1,1)=$B8)/ROW(OFFSET(cal!$A$1,0,0,$R$1-1,1)),0),E$6)),\"\")","v":""}]
[null,{"$f":"B8+1","v":3},{"$f":"DATE(cal!$B$2,cal!$C$2,B9)","v":3},{"$f":"IFERROR(INDEX(OFFSET(cal!$H$1,0,0,$R$1-1,1),1/LARGE(INDEX((OFFSET(cal!$A$1,0,0,$R$1-1,1)=$D$2)*(OFFSET(cal!$G$1,0,0,$R$1-1,1)=$B9)/ROW(OFFSET(cal!$A$1,0,0,$R$1-1,1)),0),D$6)),\"\")","v":""},{"$f":"IFERROR(INDEX(OFFSET(cal!$H$1,0,0,$R$1-1,1),1/LARGE(INDEX((OFFSET(cal!$A$1,0,0,$R$1-1,1)=$D$2)*(OFFSET(cal!$G$1,0,0,$R$1-1,1)=$B9)/ROW(OFFSET(cal!$A$1,0,0,$R$1-1,1)),0),E$6)),\"\")","v":""},"","","","","",{"$f":"IFERROR(INDEX(OFFSET(cal!$I$1,0,0,$R$1-1,1),1/LARGE(INDEX((OFFSET(cal!$A$1,0,0,$R$1-1,1)=$D$2)*(OFFSET(cal!$G$1,0,0,$R$1-1,1)=$B9)/ROW(OFFSET(cal!$A$1,0,0,$R$1-1,1)),0),D$6)),\"\")","v":""},{"$f":"IFERROR(INDEX(OFFSET(cal!$J$1,0,0,$R$1-1,1),1/LARGE(INDEX((OFFSET(cal!$A$1,0,0,$R$1-1,1)=$D$2)*(OFFSET(cal!$G$1,0,0,$R$1-1,1)=$B9)/ROW(OFFSET(cal!$A$1,0,0,$R$1-1,1)),0),D$6)),\"\")","v":""},{"$f":"IFERROR(INDEX(OFFSET(cal!$J$1,0,0,$R$1-1,1),1/LARGE(INDEX((OFFSET(cal!$A$1,0,0,$R$1-1,1)=$D$2)*(OFFSET(cal!$G$1,0,0,$R$1-1,1)=$B9)/ROW(OFFSET(cal!$A$1,0,0,$R$1-1,1)),0),E$6)),\"\")","v":""}]
[null,4,{"$f":"DATE(cal!$B$2,cal!$C$2,B10)","v":4},{"$f":"IFERROR(INDEX(OFFSET(cal!$H$1,0,0,$R$1-1,1),1/LARGE(INDEX((OFFSET(cal!$A$1,0,0,$R$1-1,1)=$D$2)*(OFFSET(cal!$G$1,0,0,$R$1-1,1)=$B10)/ROW(OFFSET(cal!$A$1,0,0,$R$1-1,1)),0),D$6)),\"\")","v":""},{"$f":"IFERROR(INDEX(OFFSET(cal!$H$1,0,0,$R$1-1,1),1/LARGE(INDEX((OFFSET(cal!$A$1,0,0,$R$1-1,1)=$D$2)*(OFFSET(cal!$G$1,0,0,$R$1-1,1)=$B10)/ROW(OFFSET(cal!$A$1,0,0,$R$1-1,1)),0),E$6)),\"\")","v":""},"","","","","",{"$f":"IFERROR(INDEX(OFFSET(cal!$I$1,0,0,$R$1-1,1),1/LARGE(INDEX((OFFSET(cal!$A$1,0,0,$R$1-1,1)=$D$2)*(OFFSET(cal!$G$1,0,0,$R$1-1,1)=$B10)/ROW(OFFSET(cal!$A$1,0,0,$R$1-1,1)),0),D$6)),\"\")","v":""},{"$f":"IFERROR(INDEX(OFFSET(cal!$J$1,0,0,$R$1-1,1),1/LARGE(INDEX((OFFSET(cal!$A$1,0,0,$R$1-1,1)=$D$2)*(OFFSET(cal!$G$1,0,0,$R$1-1,1)=$B10)/ROW(OFFSET(cal!$A$1,0,0,$R$1-1,1)),0),D$6)),\"\")","v":""},{"$f":"IFERROR(INDEX(OFFSET(cal!$J$1,0,0,$R$1-1,1),1/LARGE(INDEX((OFFSET(cal!$A$1,0,0,$R$1-1,1)=$D$2)*(OFFSET(cal!$G$1,0,0,$R$1-1,1)=$B10)/ROW(OFFSET(cal!$A$1,0,0,$R$1-1,1)),0),E$6)),\"\")","v":""}]
[null,5,{"$f":"DATE(cal!$B$2,cal!$C$2,B11)","v":5},{"$f":"IFERROR(INDEX(OFFSET(cal!$H$1,0,0,$R$1-1,1),1/LARGE(INDEX((OFFSET(cal!$A$1,0,0,$R$1-1,1)=$D$2)*(OFFSET(cal!$G$1,0,0,$R$1-1,1)=$B11)/ROW(OFFSET(cal!$A$1,0,0,$R$1-1,1)),0),D$6)),\"\")","v":""},{"$f":"IFERROR(INDEX(OFFSET(cal!$H$1,0,0,$R$1-1,1),1/LARGE(INDEX((OFFSET(cal!$A$1,0,0,$R$1-1,1)=$D$2)*(OFFSET(cal!$G$1,0,0,$R$1-1,1)=$B11)/ROW(OFFSET(cal!$A$1,0,0,$R$1-1,1)),0),E$6)),\"\")","v":""},"","","","","",{"$f":"IFERROR(INDEX(OFFSET(cal!$I$1,0,0,$R$1-1,1),1/LARGE(INDEX((OFFSET(cal!$A$1,0,0,$R$1-1,1)=$D$2)*(OFFSET(cal!$G$1,0,0,$R$1-1,1)=$B11)/ROW(OFFSET(cal!$A$1,0,0,$R$1-1,1)),0),D$6)),\"\")","v":""},{"$f":"IFERROR(INDEX(OFFSET(cal!$J$1,0,0,$R$1-1,1),1/LARGE(INDEX((OFFSET(cal!$A$1,0,0,$R$1-1,1)=$D$2)*(OFFSET(cal!$G$1,0,0,$R$1-1,1)=$B11)/ROW(OFFSET(cal!$A$1,0,0,$R$1-1,1)),0),D$6)),\"\")","v":""},{"$f":"IFERROR(INDEX(OFFSET(cal!$J$1,0,0,$R$1-1,1),1/LARGE(INDEX((OFFSET(cal!$A$1,0,0,$R$1-1,1)=$D$2)*(OFFSET(cal!$G$1,0,0,$R$1-1,1)=$B11)/ROW(OFFSET(cal!$A$1,0,0,$R$1-1,1)),0),E$6)),\"\")","v":""}]
[null,6,{"$f":"DATE(cal!$B$2,cal!$C$2,B12)","v":6},{"$f":"IFERROR(INDEX(OFFSET(cal!$H$1,0,0,$R$1-1,1),1/LARGE(INDEX((OFFSET(cal!$A$1,0,0,$R$1-1,1)=$D$2)*(OFFSET(cal!$G$1,0,0,$R$1-1,1)=$B12)/ROW(OFFSET(cal!$A$1,0,0,$R$1-1,1)),0),D$6)),\"\")","v":""},{"$f":"IFERROR(INDEX(OFFSET(cal!$H$1,0,0,$R$1-1,1),1/LARGE(INDEX((OFFSET(cal!$A$1,0,0,$R$1-1,1)=$D$2)*(OFFSET(cal!$G$1,0,0,$R$1-1,1)=$B12)/ROW(OFFSET(cal!$A$1,0,0,$R$1-1,1)),0),E$6)),\"\")","v":""},"","","","","",{"$f":"IFERROR(INDEX(OFFSET(cal!$I$1,0,0,$R$1-1,1),1/LARGE(INDEX((OFFSET(cal!$A$1,0,0,$R$1-1,1)=$D$2)*(OFFSET(cal!$G$1,0,0,$R$1-1,1)=$B12)/ROW(OFFSET(cal!$A$1,0,0,$R$1-1,1)),0),D$6)),\"\")","v":""},{"$f":"IFERROR(INDEX(OFFSET(cal!$J$1,0,0,$R$1-1,1),1/LARGE(INDEX((OFFSET(cal!$A$1,0,0,$R$1-1,1)=$D$2)*(OFFSET(cal!$G$1,0,0,$R$1-1,1)=$B12)/ROW(OFFSET(cal!$A$1,0,0,$R$1-1,1)),0),D$6)),\"\")","v":""},{"$f":"IFERROR(INDEX(OFFSET(cal!$J$1,0,0,$R$1-1,1),1/LARGE(INDEX((OFFSET(cal!$A$1,0,0,$R$1-1,1)=$D$2)*(OFFSET(cal!$G$1,0,0,$R$1-1,1)=$B12)/ROW(OFFSET(cal!$A$1,0,0,$R$1-1,1)),0),E$6)),\"\")","v":""}]
[null,7,{"$f":"DATE(cal!$B$2,cal!$C$2,B13)","v":7},{"$f":"IFERROR(INDEX(OFFSET(cal!$H$1,0,0,$R$1-1,1),1/LARGE(INDEX((OFFSET(cal!$A$1,0,0,$R$1-1,1)=$D$2)*(OFFSET(cal!$G$1,0,0,$R$1-1,1)=$B13)/ROW(OFFSET(cal!$A$1,0,0,$R$1-1,1)),0),D$6)),\"\")","v":""},{"$f":"IFERROR(INDEX(OFFSET(cal!$H$1,0,0,$R$1-1,1),1/LARGE(INDEX((OFFSET(cal!$A$1,0,0,$R$1-1,1)=$D$2)*(OFFSET(cal!$G$1,0,0,$R$1-1,1)=$B13)/ROW(OFFSET(cal!$A$1,0,0,$R$1-1,1)),0),E$6)),\"\")","v":""},"","","","","",{"$f":"IFERROR(INDEX(OFFSET(cal!$I$1,0,0,$R$1-1,1),1/LARGE(INDEX((OFFSET(cal!$A$1,0,0,$R$1-1,1)=$D$2)*(OFFSET(cal!$G$1,0,0,$R$1-1,1)=$B13)/ROW(OFFSET(cal!$A$1,0,0,$R$1-1,1)),0),D$6)),\"\")","v":""},{"$f":"IFERROR(INDEX(OFFSET(cal!$J$1,0,0,$R$1-1,1),1/LARGE(INDEX((OFFSET(cal!$A$1,0,0,$R$1-1,1)=$D$2)*(OFFSET(cal!$G$1,0,0,$R$1-1,1)=$B13)/ROW(OFFSET(cal!$A$1,0,0,$R$1-1,1)),0),D$6)),\"\")","v":""},{"$f":"IFERROR(INDEX(OFFSET(cal!$J$1,0,0,$R$1-1,1),1/LARGE(INDEX((OFFSET(cal!$A$1,0,0,$R$1-1,1)=$D$2)*(OFFSET(cal!$G$1,0,0,$R$1-1,1)=$B13)/ROW(OFFSET(cal!$A$1,0,0,$R$1-1,1)),0),E$6)),\"\")","v":""}]
[null,8,{"$f":"DATE(cal!$B$2,cal!$C$2,B14)","v":8},{"$f":"IFERROR(INDEX(OFFSET(cal!$H$1,0,0,$R$1-1,1),1/LARGE(INDEX((OFFSET(cal!$A$1,0,0,$R$1-1,1)=$D$2)*(OFFSET(cal!$G$1,0,0,$R$1-1,1)=$B14)/ROW(OFFSET(cal!$A$1,0,0,$R$1-1,1)),0),D$6)),\"\")","v":""},{"$f":"IFERROR(INDEX(OFFSET(cal!$H$1,0,0,$R$1-1,1),1/LARGE(INDEX((OFFSET(cal!$A$1,0,0,$R$1-1,1)=$D$2)*(OFFSET(cal!$G$1,0,0,$R$1-1,1)=$B14)/ROW(OFFSET(cal!$A$1,0,0,$R$1-1,1)),0),E$6)),\"\")","v":""},"","","","","",{"$f":"IFERROR(INDEX(OFFSET(cal!$I$1,0,0,$R$1-1,1),1/LARGE(INDEX((OFFSET(cal!$A$1,0,0,$R$1-1,1)=$D$2)*(OFFSET(cal!$G$1,0,0,$R$1-1,1)=$B14)/ROW(OFFSET(cal!$A$1,0,0,$R$1-1,1)),0),D$6)),\"\")","v":""},{"$f":"IFERROR(INDEX(OFFSET(cal!$J$1,0,0,$R$1-1,1),1/LARGE(INDEX((OFFSET(cal!$A$1,0,0,$R$1-1,1)=$D$2)*(OFFSET(cal!$G$1,0,0,$R$1-1,1)=$B14)/ROW(OFFSET(cal!$A$1,0,0,$R$1-1,1)),0),D$6)),\"\")","v":""},{"$f":"IFERROR(INDEX(OFFSET(cal!$J$1,0,0,$R$1-1,1),1/LARGE(INDEX((OFFSET(cal!$A$1,0,0,$R$1-1,1)=$D$2)*(OFFSET(cal!$G$1,0,0,$R$1-1,1)=$B14)/ROW(OFFSET(cal!$A$1,0,0,$R$1-1,1)),0),E$6)),\"\")","v":""},null,"※全従業員の出力は、少しタイムラグがあります。"]
[null,9,{"$f":"DATE(cal!$B$2,cal!$C$2,B15)","v":9},{"$f":"IFERROR(INDEX(OFFSET(cal!$H$1,0,0,$R$1-1,1),1/LARGE(INDEX((OFFSET(cal!$A$1,0,0,$R$1-1,1)=$D$2)*(OFFSET(cal!$G$1,0,0,$R$1-1,1)=$B15)/ROW(OFFSET(cal!$A$1,0,0,$R$1-1,1)),0),D$6)),\"\")","v":""},{"$f":"IFERROR(INDEX(OFFSET(cal!$H$1,0,0,$R$1-1,1),1/LARGE(INDEX((OFFSET(cal!$A$1,0,0,$R$1-1,1)=$D$2)*(OFFSET(cal!$G$1,0,0,$R$1-1,1)=$B15)/ROW(OFFSET(cal!$A$1,0,0,$R$1-1,1)),0),E$6)),\"\")","v":""},"","","","","",{"$f":"IFERROR(INDEX(OFFSET(cal!$I$1,0,0,$R$1-1,1),1/LARGE(INDEX((OFFSET(cal!$A$1,0,0,$R$1-1,1)=$D$2)*(OFFSET(cal!$G$1,0,0,$R$1-1,1)=$B15)/ROW(OFFSET(cal!$A$1,0,0,$R$1-1,1)),0),D$6)),\"\")","v":""},{"$f":"IFERROR(INDEX(OFFSET(cal!$J$1,0,0,$R$1-1,1),1/LARGE(INDEX((OFFSET(cal!$A$1,0,0,$R$1-1,1)=$D$2)*(OFFSET(cal!$G$1,0,0,$R$1-1,1)=$B15)/ROW(OFFSET(cal!$A$1,0,0,$R$1-1,1)),0),D$6)),\"\")","v":""},{"$f":"IFERROR(INDEX(OFFSET(cal!$J$1,0,0,$R$1-1,1),1/LARGE(INDEX((OFFSET(cal!$A$1,0,0,$R$1-1,1)=$D$2)*(OFFSET(cal!$G$1,0,0,$R$1-1,1)=$B15)/ROW(OFFSET(cal!$A$1,0,0,$R$1-1,1)),0),E$6)),\"\")","v":""},null,"※PDFはマージされません"]
[null,10,{"$f":"DATE(cal!$B$2,cal!$C$2,B16)","v":10},{"$f":"IFERROR(INDEX(OFFSET(cal!$H$1,0,0,$R$1-1,1),1/LARGE(INDEX((OFFSET(cal!$A$1,0,0,$R$1-1,1)=$D$2)*(OFFSET(cal!$G$1,0,0,$R$1-1,1)=$B16)/ROW(OFFSET(cal!$A$1,0,0,$R$1-1,1)),0),D$6)),\"\")","v":""},{"$f":"IFERROR(INDEX(OFFSET(cal!$H$1,0,0,$R$1-1,1),1/LARGE(INDEX((OFFSET(cal!$A$1,0,0,$R$1-1,1)=$D$2)*(OFFSET(cal!$G$1,0,0,$R$1-1,1)=$B16)/ROW(OFFSET(cal!$A$1,0,0,$R$1-1,1)),0),E$6)),\"\")","v":""},"","","","","",{"$f":"IFERROR(INDEX(OFFSET(cal!$I$1,0,0,$R$1-1,1),1/LARGE(INDEX((OFFSET(cal!$A$1,0,0,$R$1-1,1)=$D$2)*(OFFSET(cal!$G$1,0,0,$R$1-1,1)=$B16)/ROW(OFFSET(cal!$A$1,0,0,$R$1-1,1)),0),D$6)),\"\")","v":""},{"$f":"IFERROR(INDEX(OFFSET(cal!$J$1,0,0,$R$1-1,1),1/LARGE(INDEX((OFFSET(cal!$A$1,0,0,$R$1-1,1)=$D$2)*(OFFSET(cal!$G$1,0,0,$R$1-1,1)=$B16)/ROW(OFFSET(cal!$A$1,0,0,$R$1-1,1)),0),D$6)),\"\")","v":""},{"$f":"IFERROR(INDEX(OFFSET(cal!$J$1,0,0,$R$1-1,1),1/LARGE(INDEX((OFFSET(cal!$A$1,0,0,$R$1-1,1)=$D$2)*(OFFSET(cal!$G$1,0,0,$R$1-1,1)=$B16)/ROW(OFFSET(cal!$A$1,0,0,$R$1-1,1)),0),E$6)),\"\")","v":""}]
[null,11,{"$f":"DATE(cal!$B$2,cal!$C$2,B17)","v":11},{"$f":"IFERROR(INDEX(OFFSET(cal!$H$1,0,0,$R$1-1,1),1/LARGE(INDEX((OFFSET(cal!$A$1,0,0,$R$1-1,1)=$D$2)*(OFFSET(cal!$G$1,0,0,$R$1-1,1)=$B17)/ROW(OFFSET(cal!$A$1,0,0,$R$1-1,1)),0),D$6)),\"\")","v":""},{"$f":"IFERROR(INDEX(OFFSET(cal!$H$1,0,0,$R$1-1,1),1/LARGE(INDEX((OFFSET(cal!$A$1,0,0,$R$1-1,1)=$D$2)*(OFFSET(cal!$G$1,0,0,$R$1-1,1)=$B17)/ROW(OFFSET(cal!$A$1,0,0,$R$1-1,1)),0),E$6)),\"\")","v":""},"","","","","",{"$f":"IFERROR(INDEX(OFFSET(cal!$I$1,0,0,$R$1-1,1),1/LARGE(INDEX((OFFSET(cal!$A$1,0,0,$R$1-1,1)=$D$2)*(OFFSET(cal!$G$1,0,0,$R$1-1,1)=$B17)/ROW(OFFSET(cal!$A$1,0,0,$R$1-1,1)),0),D$6)),\"\")","v":""},{"$f":"IFERROR(INDEX(OFFSET(cal!$J$1,0,0,$R$1-1,1),1/LARGE(INDEX((OFFSET(cal!$A$1,0,0,$R$1-1,1)=$D$2)*(OFFSET(cal!$G$1,0,0,$R$1-1,1)=$B17)/ROW(OFFSET(cal!$A$1,0,0,$R$1-1,1)),0),D$6)),\"\")","v":""},{"$f":"IFERROR(INDEX(OFFSET(cal!$J$1,0,0,$R$1-1,1),1/LARGE(INDEX((OFFSET(cal!$A$1,0,0,$R$1-1,1)=$D$2)*(OFFSET(cal!$G$1,0,0,$R$1-1,1)=$B17)/ROW(OFFSET(cal!$A$1,0,0,$R$1-1,1)),0),E$6)),\"\")","v":""}]
[null,12,{"$f":"DATE(cal!$B$2,cal!$C$2,B18)","v":12},{"$f":"IFERROR(INDEX(OFFSET(cal!$H$1,0,0,$R$1-1,1),1/LARGE(INDEX((OFFSET(cal!$A$1,0,0,$R$1-1,1)=$D$2)*(OFFSET(cal!$G$1,0,0,$R$1-1,1)=$B18)/ROW(OFFSET(cal!$A$1,0,0,$R$1-1,1)),0),D$6)),\"\")","v":""},{"$f":"IFERROR(INDEX(OFFSET(cal!$H$1,0,0,$R$1-1,1),1/LARGE(INDEX((OFFSET(cal!$A$1,0,0,$R$1-1,1)=$D$2)*(OFFSET(cal!$G$1,0,0,$R$1-1,1)=$B18)/ROW(OFFSET(cal!$A$1,0,0,$R$1-1,1)),0),E$6)),\"\")","v":""},"","","","","",{"$f":"IFERROR(INDEX(OFFSET(cal!$I$1,0,0,$R$1-1,1),1/LARGE(INDEX((OFFSET(cal!$A$1,0,0,$R$1-1,1)=$D$2)*(OFFSET(cal!$G$1,0,0,$R$1-1,1)=$B18)/ROW(OFFSET(cal!$A$1,0,0,$R$1-1,1)),0),D$6)),\"\")","v":""},{"$f":"IFERROR(INDEX(OFFSET(cal!$J$1,0,0,$R$1-1,1),1/LARGE(INDEX((OFFSET(cal!$A$1,0,0,$R$1-1,1)=$D$2)*(OFFSET(cal!$G$1,0,0,$R$1-1,1)=$B18)/ROW(OFFSET(cal!$A$1,0,0,$R$1-1,1)),0),D$6)),\"\")","v":""},{"$f":"IFERROR(INDEX(OFFSET(cal!$J$1,0,0,$R$1-1,1),1/LARGE(INDEX((OFFSET(cal!$A$1,0,0,$R$1-1,1)=$D$2)*(OFFSET(cal!$G$1,0,0,$R$1-1,1)=$B18)/ROW(OFFSET(cal!$A$1,0,0,$R$1-1,1)),0),E$6)),\"\")","v":""}]
[null,13,{"$f":"DATE(cal!$B$2,cal!$C$2,B19)","v":13},{"$f":"IFERROR(INDEX(OFFSET(cal!$H$1,0,0,$R$1-1,1),1/LARGE(INDEX((OFFSET(cal!$A$1,0,0,$R$1-1,1)=$D$2)*(OFFSET(cal!$G$1,0,0,$R$1-1,1)=$B19)/ROW(OFFSET(cal!$A$1,0,0,$R$1-1,1)),0),D$6)),\"\")","v":""},{"$f":"IFERROR(INDEX(OFFSET(cal!$H$1,0,0,$R$1-1,1),1/LARGE(INDEX((OFFSET(cal!$A$1,0,0,$R$1-1,1)=$D$2)*(OFFSET(cal!$G$1,0,0,$R$1-1,1)=$B19)/ROW(OFFSET(cal!$A$1,0,0,$R$1-1,1)),0),E$6)),\"\")","v":""},"","","","","",{"$f":"IFERROR(INDEX(OFFSET(cal!$I$1,0,0,$R$1-1,1),1/LARGE(INDEX((OFFSET(cal!$A$1,0,0,$R$1-1,1)=$D$2)*(OFFSET(cal!$G$1,0,0,$R$1-1,1)=$B19)/ROW(OFFSET(cal!$A$1,0,0,$R$1-1,1)),0),D$6)),\"\")","v":""},{"$f":"IFERROR(INDEX(OFFSET(cal!$J$1,0,0,$R$1-1,1),1/LARGE(INDEX((OFFSET(cal!$A$1,0,0,$R$1-1,1)=$D$2)*(OFFSET(cal!$G$1,0,0,$R$1-1,1)=$B19)/ROW(OFFSET(cal!$A$1,0,0,$R$1-1,1)),0),D$6)),\"\")","v":""},{"$f":"IFERROR(INDEX(OFFSET(cal!$J$1,0,0,$R$1-1,1),1/LARGE(INDEX((OFFSET(cal!$A$1,0,0,$R$1-1,1)=$D$2)*(OFFSET(cal!$G$1,0,0,$R$1-1,1)=$B19)/ROW(OFFSET(cal!$A$1,0,0,$R$1-1,1)),0),E$6)),\"\")","v":""}]
[null,14,{"$f":"DATE(cal!$B$2,cal!$C$2,B20)","v":14},{"$f":"IFERROR(INDEX(OFFSET(cal!$H$1,0,0,$R$1-1,1),1/LARGE(INDEX((OFFSET(cal!$A$1,0,0,$R$1-1,1)=$D$2)*(OFFSET(cal!$G$1,0,0,$R$1-1,1)=$B20)/ROW(OFFSET(cal!$A$1,0,0,$R$1-1,1)),0),D$6)),\"\")","v":""},{"$f":"IFERROR(INDEX(OFFSET(cal!$H$1,0,0,$R$1-1,1),1/LARGE(INDEX((OFFSET(cal!$A$1,0,0,$R$1-1,1)=$D$2)*(OFFSET(cal!$G$1,0,0,$R$1-1,1)=$B20)/ROW(OFFSET(cal!$A$1,0,0,$R$1-1,1)),0),E$6)),\"\")","v":""},"","","","","",{"$f":"IFERROR(INDEX(OFFSET(cal!$I$1,0,0,$R$1-1,1),1/LARGE(INDEX((OFFSET(cal!$A$1,0,0,$R$1-1,1)=$D$2)*(OFFSET(cal!$G$1,0,0,$R$1-1,1)=$B20)/ROW(OFFSET(cal!$A$1,0,0,$R$1-1,1)),0),D$6)),\"\")","v":""},{"$f":"IFERROR(INDEX(OFFSET(cal!$J$1,0,0,$R$1-1,1),1/LARGE(INDEX((OFFSET(cal!$A$1,0,0,$R$1-1,1)=$D$2)*(OFFSET(cal!$G$1,0,0,$R$1-1,1)=$B20)/ROW(OFFSET(cal!$A$1,0,0,$R$1-1,1)),0),D$6)),\"\")","v":""},{"$f":"IFERROR(INDEX(OFFSET(cal!$J$1,0,0,$R$1-1,1),1/LARGE(INDEX((OFFSET(cal!$A$1,0,0,$R$1-1,1)=$D$2)*(OFFSET(cal!$G$1,0,0,$R$1-1,1)=$B20)/ROW(OFFSET(cal!$A$1,0,0,$R$1-1,1)),0),E$6)),\"\")","v":""}]
{"$rows_left_out":20}